Target
Pro-cathepsin H
Ligand
BDBM50425024
Substrate
Meas. Tech.
ChEMBL_936321 (CHEMBL2321253)
Ki
221000±n/a nM
Citation
 Sosic, IMirkovic, BArenz, KStefane, BKos, JGobec, S Development of new cathepsin B inhibitors: combining bioisosteric replacements and structure-based design to explore the structure-activity relationships of nitroxoline derivatives. J Med Chem 56:521-33 (2013)  
Target
Name:
Pro-cathepsin H
Synonyms:
CATH_HUMAN CPSB Cathepsin H Cathepsin H light chain | Cathepsin H mini chain
Type:
PROTEIN
Mol. Mass.:
37402.31
Organism:
Homo sapiens (Human)
Description:
ChEMBL_1459870
Residue:
335
  
Inhibitor
Name:
BDBM50425024
Synonyms:
CHEMBL2312204
Type:
Small organic molecule
Emp. Form.:
C15H17N3O2
Mol. Mass.:
271.3144
SMILES:
CC1CCN(CC1)c1ccc([N+]([O-])=O)c2cccnc12
: