Target
Acyl-CoA desaturase 1
Ligand
BDBM50425255
Substrate
Meas. Tech.
ChEMBL_933806 (CHEMBL2321360)
IC50
8.0±n/a nM
Citation
 Deng, YYang, ZShipps, GWLo, SMWest, RHwa, JZheng, SFarley, CLachowicz, Jvan Heek, MBass, ASSinha, DPMahon, CRCartwright, ME Discovery of liver-targeted inhibitors of stearoyl-CoA desaturase (SCD1). Bioorg Med Chem Lett 23:791-6 (2013)  
Target
Name:
Acyl-CoA desaturase 1
Synonyms:
ACOD1_RAT Scd Stearoyl-CoA desaturase 1 (SCD1)
Type:
Enzyme
Mol. Mass.:
41485.97
Organism:
Rattus norvegicus (Rat)
Description:
P07308
Residue:
358
  
Inhibitor
Name:
BDBM50425255
Synonyms:
CHEMBL2315180
Type:
Small organic molecule
Emp. Form.:
C25H24F3N3O3S
Mol. Mass.:
503.537
SMILES:
OC(=O)c1cnc(s1)N1CCC2(CC1)CCN(Cc1cccc(c1)C(F)(F)F)c1ccccc1O2
: