Target
Acyl-CoA desaturase 1
Ligand
BDBM50425257
Substrate
Meas. Tech.
ChEMBL_933806 (CHEMBL2321360)
IC50
4.0±n/a nM
Citation
 Deng, YYang, ZShipps, GWLo, SMWest, RHwa, JZheng, SFarley, CLachowicz, Jvan Heek, MBass, ASSinha, DPMahon, CRCartwright, ME Discovery of liver-targeted inhibitors of stearoyl-CoA desaturase (SCD1). Bioorg Med Chem Lett 23:791-6 (2013)  
Target
Name:
Acyl-CoA desaturase 1
Synonyms:
ACOD1_RAT Scd Stearoyl-CoA desaturase 1 (SCD1)
Type:
Enzyme
Mol. Mass.:
41485.97
Organism:
Rattus norvegicus (Rat)
Description:
P07308
Residue:
358
  
Inhibitor
Name:
BDBM50425257
Synonyms:
CHEMBL2315472
Type:
Small organic molecule
Emp. Form.:
C29H36N4O2S
Mol. Mass.:
504.687
SMILES:
CNC(=O)c1cnc(s1)N1CCC2(CC1)CCN(Cc1ccc(cc1)C(C)(C)C)c1ccccc1O2
: