Target
Acyl-CoA desaturase 1
Ligand
BDBM50425271
Substrate
Meas. Tech.
ChEMBL_933806 (CHEMBL2321360)
IC50
2450±n/a nM
Citation
 Deng, YYang, ZShipps, GWLo, SMWest, RHwa, JZheng, SFarley, CLachowicz, Jvan Heek, MBass, ASSinha, DPMahon, CRCartwright, ME Discovery of liver-targeted inhibitors of stearoyl-CoA desaturase (SCD1). Bioorg Med Chem Lett 23:791-6 (2013)  
Target
Name:
Acyl-CoA desaturase 1
Synonyms:
ACOD1_RAT Scd Stearoyl-CoA desaturase 1 (SCD1)
Type:
Enzyme
Mol. Mass.:
41485.97
Organism:
Rattus norvegicus (Rat)
Description:
P07308
Residue:
358
  
Inhibitor
Name:
BDBM50425271
Synonyms:
CHEMBL2315485
Type:
Small organic molecule
Emp. Form.:
C25H28F3N3O3
Mol. Mass.:
475.5033
SMILES:
NC(=O)CCN1CCC2(CCN(CC2)C(=O)Cc2cccc(c2)C(F)(F)F)Oc2ccccc12
: