Target
Acyl-CoA desaturase 1
Ligand
BDBM50425272
Substrate
Meas. Tech.
ChEMBL_933806 (CHEMBL2321360)
IC50
180±n/a nM
Citation
 Deng, YYang, ZShipps, GWLo, SMWest, RHwa, JZheng, SFarley, CLachowicz, Jvan Heek, MBass, ASSinha, DPMahon, CRCartwright, ME Discovery of liver-targeted inhibitors of stearoyl-CoA desaturase (SCD1). Bioorg Med Chem Lett 23:791-6 (2013)  
Target
Name:
Acyl-CoA desaturase 1
Synonyms:
ACOD1_RAT Scd Stearoyl-CoA desaturase 1 (SCD1)
Type:
Enzyme
Mol. Mass.:
41485.97
Organism:
Rattus norvegicus (Rat)
Description:
P07308
Residue:
358
  
Inhibitor
Name:
BDBM50425272
Synonyms:
CHEMBL2315486
Type:
Small organic molecule
Emp. Form.:
C28H37N3O3
Mol. Mass.:
463.6117
SMILES:
CC(C)(C)c1ccc(CC(=O)N2CCC3(CC2)CCN(CCC(N)=O)c2ccccc2O3)cc1
: