Target
Acyl-CoA desaturase 1
Ligand
BDBM50425273
Substrate
Meas. Tech.
ChEMBL_933771 (CHEMBL2321107)
IC50
6400±n/a nM
Citation
 Deng, YYang, ZShipps, GWLo, SMWest, RHwa, JZheng, SFarley, CLachowicz, Jvan Heek, MBass, ASSinha, DPMahon, CRCartwright, ME Discovery of liver-targeted inhibitors of stearoyl-CoA desaturase (SCD1). Bioorg Med Chem Lett 23:791-6 (2013)  
Target
Name:
Acyl-CoA desaturase 1
Synonyms:
ACOD1_MOUSE | Scd1
Type:
PROTEIN
Mol. Mass.:
41064.54
Organism:
Mus musculus
Description:
ChEMBL_1462109
Residue:
355
  
Inhibitor
Name:
BDBM50425273
Synonyms:
CHEMBL2315512
Type:
Small organic molecule
Emp. Form.:
C22H33N3O3
Mol. Mass.:
387.5157
SMILES:
CC(C)CCN1CCC2(CCN(CC2)C(=O)CNC(C)=O)Oc2ccccc12
: