Target
Acyl-CoA desaturase 1
Ligand
BDBM50425291
Substrate
Meas. Tech.
ChEMBL_933806 (CHEMBL2321360)
IC50
1800±n/a nM
Citation
 Deng, YYang, ZShipps, GWLo, SMWest, RHwa, JZheng, SFarley, CLachowicz, Jvan Heek, MBass, ASSinha, DPMahon, CRCartwright, ME Discovery of liver-targeted inhibitors of stearoyl-CoA desaturase (SCD1). Bioorg Med Chem Lett 23:791-6 (2013)  
Target
Name:
Acyl-CoA desaturase 1
Synonyms:
ACOD1_RAT Scd Stearoyl-CoA desaturase 1 (SCD1)
Type:
Enzyme
Mol. Mass.:
41485.97
Organism:
Rattus norvegicus (Rat)
Description:
P07308
Residue:
358
  
Inhibitor
Name:
BDBM50425291
Synonyms:
CHEMBL2315501
Type:
Small organic molecule
Emp. Form.:
C25H31N3O4
Mol. Mass.:
437.5313
SMILES:
COc1cccc(CN2CCC3(CCN(CC3)C(=O)CNC(C)=O)Oc3ccccc23)c1
: