Target
Thyroid hormone receptor beta
Ligand
BDBM50036399
Substrate
Meas. Tech.
ChEMBL_935146 (CHEMBL2317308)
Ki
2.2±n/a nM
Citation
 Shiohara, HNakamura, TKikuchi, NOzawa, TMatsuzawa, ANagano, ROhnota, HMiyamoto, TIchikawa, KHashizume, K Design, synthesis, and structure-activity relationship (SAR) of N-[7-(4-hydroxyphenoxy)-6-methylindan-4-yl]malonamic acids as thyroid hormone receptorß (TRß) selective agonists. Bioorg Med Chem 21:592-607 (2013)  
Target
Name:
Thyroid hormone receptor beta
Synonyms:
ERBA2 Nuclear receptor subfamily 1 group A member 2 THR1 c-erbA-2 | c-erbA-beta
Type:
Receptor
Mol. Mass.:
52793.62
Organism:
Homo sapiens (Human)
Description:
Recombinant hThR was obtained from nuclear extracts from SF9 cells infected with baculovirus vectors encoding for ThRbeta 1.
Residue:
461
  
Inhibitor
Name:
BDBM50036399
Synonyms:
Axitirome N-(4-{3-[(4-Fluoro-phenyl)-hydroxy-methyl]-4-hydroxy-phenoxy}-3,5-dimethyl-phenyl)-oxalamic acid ethyl ester
Type:
Small organic molecule
Emp. Form.:
C25H24FNO6
Mol. Mass.:
453.4596
SMILES:
CCOC(=O)C(=O)Nc1cc(C)c(Oc2ccc(O)c(c2)C(O)c2ccc(F)cc2)c(C)c1
: