Target
Dual specificity protein phosphatase CDC14A
Ligand
BDBM50425807
Substrate
Meas. Tech.
ChEMBL_937592 (CHEMBL2321061)
IC50
6000±n/a nM
Citation
 He, YXu, JYu, ZHGunawan, AMWu, LWang, LZhang, ZY Discovery and evaluation of novel inhibitors of mycobacterium protein tyrosine phosphatase B from the 6-Hydroxy-benzofuran-5-carboxylic acid scaffold. J Med Chem 56:832-42 (2013)  
Target
Name:
Dual specificity protein phosphatase CDC14A
Synonyms:
3.1.3.16 CC14A_HUMAN CDC14A
Type:
Mol. Mass.:
66598.40
Organism:
Homo sapiens (Human)
Description:
Q9UNH5
Residue:
594
  
Inhibitor
Name:
BDBM50425807
Synonyms:
CHEMBL2316902
Type:
Small organic molecule
Emp. Form.:
C24H13F3O4
Mol. Mass.:
422.3528
SMILES:
OC(=O)c1cc2c(C#Cc3cccc(c3)C(F)(F)F)c(oc2cc1O)-c1ccccc1
: