Target
Laforin
Ligand
BDBM50425808
Substrate
Meas. Tech.
ChEMBL_937595 (CHEMBL2321064)
IC50
>30000±n/a nM
Citation
 He, YXu, JYu, ZHGunawan, AMWu, LWang, LZhang, ZY Discovery and evaluation of novel inhibitors of mycobacterium protein tyrosine phosphatase B from the 6-Hydroxy-benzofuran-5-carboxylic acid scaffold. J Med Chem 56:832-42 (2013)  
Target
Name:
Laforin
Synonyms:
EPM2A LAFPTPase Laforin
Type:
Protein
Mol. Mass.:
37158.16
Organism:
Homo sapiens (Human)
Description:
O95278
Residue:
331
  
Inhibitor
Name:
BDBM50425808
Synonyms:
CHEMBL2316906
Type:
Small organic molecule
Emp. Form.:
C23H12F2O4
Mol. Mass.:
390.3358
SMILES:
OC(=O)c1cc2c(C#Cc3cc(F)cc(F)c3)c(oc2cc1O)-c1ccccc1
: