Target
Tyrosine-protein phosphatase non-receptor type 9
Ligand
BDBM50425814
Substrate
Meas. Tech.
ChEMBL_937600 (CHEMBL2321069)
IC50
9200±n/a nM
Citation
 He, YXu, JYu, ZHGunawan, AMWu, LWang, LZhang, ZY Discovery and evaluation of novel inhibitors of mycobacterium protein tyrosine phosphatase B from the 6-Hydroxy-benzofuran-5-carboxylic acid scaffold. J Med Chem 56:832-42 (2013)  
Target
Name:
Tyrosine-protein phosphatase non-receptor type 9
Synonyms:
3.1.3.48 PTP-MEG2 PTPase MEG2 Protein-tyrosine phosphatase MEG2 (PTP-Meg2) | Tyrosine-protein phosphatase non-receptor type 9
Type:
Mol. Mass.:
68030.33
Organism:
Homo sapiens (Human)
Description:
P43378
Residue:
593
  
Inhibitor
Name:
BDBM50425814
Synonyms:
CHEMBL2311593
Type:
Small organic molecule
Emp. Form.:
C23H14F2O4
Mol. Mass.:
392.3517
SMILES:
OC(=O)c1cc2c(\C=C/c3cc(F)cc(F)c3)c(oc2cc1O)-c1ccccc1
: