Target
NAD-dependent protein deacetylase sirtuin-1
Ligand
BDBM69064
Substrate
Meas. Tech.
ChEMBL_934585 (CHEMBL2317546)
IC50
>300000±n/a nM
Citation
 Wu, JLi, YChen, KJiang, HXu, MHLiu, D Identification of benzofuran-3-yl(phenyl)methanones as novel SIRT1 inhibitors: binding mode, inhibitory mechanism and biological action. Eur J Med Chem 60:441-50 (2013)  
Target
Name:
NAD-dependent protein deacetylase sirtuin-1
Synonyms:
NAD-Dependent Deacetylase Sirtuin-1 NAD-dependent protein deacetylase sirtuin-1 (SIRT1) SIR2-like protein 1 SIRT1 Sirtuin-1 (SIRT1) | hSIR2
Type:
Developmental protein; hydrolase
Mol. Mass.:
81626.66
Organism:
Homo sapiens (Human)
Description:
Residue:
747
  
Inhibitor
Name:
BDBM69064
Synonyms:
3-(2,5-dimethoxybenzoyl)-1-benzofuran-5-yl acetate SMR000226432 [3-(2,5-dimethoxyphenyl)carbonyl-1-benzofuran-5-yl] ethanoate acetic acid [3-[(2,5-dimethoxyphenyl)-oxomethyl]-5-benzofuranyl] ester | cid_867287
Type:
Small organic molecule
Emp. Form.:
C19H16O6
Mol. Mass.:
340.3267
SMILES:
COc1ccc(OC)c(c1)C(=O)c1coc2ccc(OC(C)=O)cc12
: