Target
Cathepsin K
Ligand
BDBM50426158
Substrate
Meas. Tech.
ChEMBL_935505 (CHEMBL2319564)
IC50
21300±n/a nM
Citation
 Schröder, JKlinger, AOellien, FMarhöfer, RJDuszenko, MSelzer, PM Docking-based virtual screening of covalently binding ligands: an orthogonal lead discovery approach. J Med Chem 56:1478-90 (2013)  
Target
Name:
Cathepsin K
Synonyms:
CATK_HUMAN CTSO Cathepsin O Cathepsin X
Type:
Enzyme
Mol. Mass.:
36975.68
Organism:
Homo sapiens (Human)
Description:
P43235
Residue:
329
  
Inhibitor
Name:
BDBM50426158
Synonyms:
CHEMBL2316612
Type:
Small organic molecule
Emp. Form.:
C14H16ClNOS
Mol. Mass.:
281.801
SMILES:
Clc1ccc(SCC2N3CCC(CC3)C2=O)cc1
: