Target
Cathepsin K
Ligand
BDBM50426167
Substrate
Meas. Tech.
ChEMBL_935499 (CHEMBL2319558)
Ki
12±n/a nM
Citation
 Schröder, JKlinger, AOellien, FMarhöfer, RJDuszenko, MSelzer, PM Docking-based virtual screening of covalently binding ligands: an orthogonal lead discovery approach. J Med Chem 56:1478-90 (2013)  
Target
Name:
Cathepsin K
Synonyms:
CATK_HUMAN CTSO Cathepsin O Cathepsin X
Type:
Enzyme
Mol. Mass.:
36975.68
Organism:
Homo sapiens (Human)
Description:
P43235
Residue:
329
  
Inhibitor
Name:
BDBM50426167
Synonyms:
CHEMBL2316590
Type:
Small organic molecule
Emp. Form.:
C28H38N4O4S
Mol. Mass.:
526.691
SMILES:
CC(C)CC(NC(=O)N1CCNCC1)C(=O)NC(CCc1ccccc1)C=CS(=O)(=O)c1ccccc1
: