Target
Cathepsin K
Ligand
BDBM50066648
Substrate
Meas. Tech.
ChEMBL_935501 (CHEMBL2319560)
Ki
3.5±n/a nM
Citation
 Schröder, JKlinger, AOellien, FMarhöfer, RJDuszenko, MSelzer, PM Docking-based virtual screening of covalently binding ligands: an orthogonal lead discovery approach. J Med Chem 56:1478-90 (2013)  
Target
Name:
Cathepsin K
Synonyms:
CATK_HUMAN CTSO Cathepsin O Cathepsin X
Type:
Enzyme
Mol. Mass.:
36975.68
Organism:
Homo sapiens (Human)
Description:
P43235
Residue:
329
  
Inhibitor
Name:
BDBM50066648
Synonyms:
((S)-3-Methyl-1-{3-[(S)-4-methyl-2-(pyridin-4-ylmethoxycarbonylamino)-pentanoylamino]-4-oxo-pyrrolidin-1-ylmethyl}-butyl)-carbamic acid benzyl ester | CHEMBL119285
Type:
Small organic molecule
Emp. Form.:
C31H43N5O6
Mol. Mass.:
581.703
SMILES:
CC(C)C[C@@H](CN1CC(NC(=O)[C@H](CC(C)C)NC(=O)OCc2ccncc2)C(=O)C1)NC(=O)OCc1ccccc1
: