Target
Cytochrome P450 1A2
Ligand
BDBM50426305
Substrate
Meas. Tech.
ChEMBL_939578 (CHEMBL2328462)
IC50
>100000±n/a nM
Citation
 Maurya, RSoni, AAnand, DRavi, MRaju, KSTaneja, INaikade, NKPuri, SKWahajuddin, naKanojiya, SYadav, PP Synthesis and antimalarial activity of 3,3-spiroanellated 5,6-disubstituted 1,2,4-trioxanes. ACS Med Chem Lett 4:165-9 (2013)  
Target
Name:
Cytochrome P450 1A2
Synonyms:
CP1A2_RAT Cyp1a-2 Cytochrome P-448 Cytochrome P450-D
Type:
PROTEIN
Mol. Mass.:
58273.18
Organism:
Rattus norvegicus
Description:
ChEMBL_1487340
Residue:
513
  
Inhibitor
Name:
BDBM50426305
Synonyms:
ARTEMOTIL
Type:
Small organic molecule
Emp. Form.:
C17H28O5
Mol. Mass.:
312.4012
SMILES:
CCO[C@H]1O[C@@H]2O[C@@]3(C)CC[C@H]4[C@H](C)CC[C@@H]([C@H]1C)[C@@]24OO3
: