Target
Lysine--tRNA ligase
Ligand
BDBM50426525
Substrate
Meas. Tech.
ChEMBL_938404 (CHEMBL2329347)
IC50
79±n/a nM
Citation
 Abdel-Magid, AF Spleen Tyrosine Kinase Inhibitors (SYK) as Potential Treatment for Autoimmune and Inflammatory Disorders: Patent Highlight. ACS Med Chem Lett 4:18-9 (2013)  
Target
Name:
Lysine--tRNA ligase
Synonyms:
KARS KIAA0070 SYK_HUMAN
Type:
PROTEIN
Mol. Mass.:
68044.78
Organism:
Homo sapiens (Human)
Description:
ChEMBL_960665
Residue:
597
  
Inhibitor
Name:
BDBM50426525
Synonyms:
CHEMBL2323631
Type:
Small organic molecule
Emp. Form.:
C20H18N4O3S
Mol. Mass.:
394.447
SMILES:
COc1ccc(Nc2nc(nc3scnc23)-c2cccc(CO)c2)cc1OC
: