Target
Lysine--tRNA ligase
Ligand
BDBM50426528
Substrate
Meas. Tech.
ChEMBL_938404 (CHEMBL2329347)
IC50
65±n/a nM
Citation
 Abdel-Magid, AF Spleen Tyrosine Kinase Inhibitors (SYK) as Potential Treatment for Autoimmune and Inflammatory Disorders: Patent Highlight. ACS Med Chem Lett 4:18-9 (2013)  
Target
Name:
Lysine--tRNA ligase
Synonyms:
KARS KIAA0070 SYK_HUMAN
Type:
PROTEIN
Mol. Mass.:
68044.78
Organism:
Homo sapiens (Human)
Description:
ChEMBL_960665
Residue:
597
  
Inhibitor
Name:
BDBM50426528
Synonyms:
CHEMBL2323633
Type:
Small organic molecule
Emp. Form.:
C25H25N7O5S
Mol. Mass.:
535.575
SMILES:
COc1ccc(Nc2nc(nc3scnc23)N2CCCC(C2)C(=O)Nc2ccc(nc2)C(O)=O)cc1OC
: