Target
Intermediate conductance calcium-activated potassium channel protein 4
Ligand
BDBM50371391
Substrate
Meas. Tech.
ChEMBL_938829 (CHEMBL2328098)
IC50
6±n/a nM
Citation
 Bagal, SKBrown, ADCox, PJOmoto, KOwen, RMPryde, DCSidders, BSkerratt, SEStevens, EBStorer, RISwain, NA Ion channels as therapeutic targets: a drug discovery perspective. J Med Chem 56:593-624 (2013)  
Target
Name:
Intermediate conductance calcium-activated potassium channel protein 4
Synonyms:
IK1 KCA4 KCNN4_HUMAN SK4
Type:
PROTEIN
Mol. Mass.:
47723.22
Organism:
Homo sapiens (Human)
Description:
ChEMBL_1361891
Residue:
427
  
Inhibitor
Name:
BDBM50371391
Synonyms:
SENICAPOC
Type:
Small organic molecule
Emp. Form.:
C20H15F2NO
Mol. Mass.:
323.336
SMILES:
NC(=O)C(c1ccccc1)(c1ccc(F)cc1)c1ccc(F)cc1
: