Target
Potassium voltage-gated channel subfamily C member 1
Ligand
BDBM50254790
Substrate
Meas. Tech.
ChEMBL_938832 (CHEMBL2328101)
IC50
800±n/a nM
Citation
 Bagal, SKBrown, ADCox, PJOmoto, KOwen, RMPryde, DCSidders, BSkerratt, SEStevens, EBStorer, RISwain, NA Ion channels as therapeutic targets: a drug discovery perspective. J Med Chem 56:593-624 (2013)  
Target
Name:
Potassium voltage-gated channel subfamily C member 1
Synonyms:
KCNC1_RAT NGK2 Voltage-gated potassium channel subunit Kv3.1 | Voltage-gated potassium channel subunit Kv4
Type:
PROTEIN
Mol. Mass.:
65852.49
Organism:
Rattus norvegicus
Description:
ChEMBL_938832
Residue:
585
  
Inhibitor
Name:
BDBM50254790
Synonyms:
(S)-Norfluoxetine NORFLUOXETINE
Type:
Small organic molecule
Emp. Form.:
C16H16F3NO
Mol. Mass.:
295.2995
SMILES:
NCC[C@H](Oc1ccc(cc1)C(F)(F)F)c1ccccc1
: