Target
Sodium channel protein type 3 subunit alpha
Ligand
BDBM50426577
Substrate
Meas. Tech.
ChEMBL_938838 (CHEMBL2328107)
IC50
30±n/a nM
Citation
 Bagal, SKBrown, ADCox, PJOmoto, KOwen, RMPryde, DCSidders, BSkerratt, SEStevens, EBStorer, RISwain, NA Ion channels as therapeutic targets: a drug discovery perspective. J Med Chem 56:593-624 (2013)  
Target
Name:
Sodium channel protein type 3 subunit alpha
Synonyms:
KIAA1356 NAC3 SCN3A_HUMAN Sodium channel alpha subunits; brain (Types I, II, III) Voltage-gated sodium channel subunit alpha Nav1.3 (Nav1.3)
Type:
Protein
Mol. Mass.:
226276.42
Organism:
Homo sapiens (Human)
Description:
Q9NY46
Residue:
2000
  
Inhibitor
Name:
BDBM50426577
Synonyms:
CHEMBL2324354
Type:
Small organic molecule
Emp. Form.:
C18H12Cl2F3N3O3S2
Mol. Mass.:
510.337
SMILES:
FC(F)(F)c1cc(CNC(=O)c2ccc(cc2)S(=O)(=O)Nc2ncc(Cl)s2)ccc1Cl
: