Target
Melatonin receptor type 1A
Ligand
BDBM50426656
Substrate
Meas. Tech.
ChEMBL_939500 (CHEMBL2328005)
EC50
8.4±n/a nM
Citation
 Hu, YZhu, JChan, KHWong, YH Development of substituted N-[3-(3-methoxylphenyl)propyl] amides as MT(2)-selective melatonin agonists: improving metabolic stability. Bioorg Med Chem 21:547-52 (2012)  
Target
Name:
Melatonin receptor type 1A
Synonyms:
MTNR1A MTR1A_HUMAN Mel1a melatonin receptor Melatonin receptor Melatonin receptor type 1 (MT1) | Melatonin receptor type 1A
Type:
Enzyme
Mol. Mass.:
39392.94
Organism:
Homo sapiens (Human)
Description:
P48039
Residue:
350
  
Inhibitor
Name:
BDBM50426656
Synonyms:
CHEMBL2326200
Type:
Small organic molecule
Emp. Form.:
C22H25NO3
Mol. Mass.:
351.4388
SMILES:
CCC(=O)NCCCc1cc(OC)ccc1C#Cc1cccc(OC)c1
: