Target
Tyrosine-protein kinase JAK2
Ligand
BDBM50393756
Substrate
Meas. Tech.
ChEMBL_940563 (CHEMBL2327181)
IC50
6000±n/a nM
Citation
 Van Epps, SFiamengo, BEdmunds, JEricsson, AFrank, KFriedman, MGeorge, DGeorge, JGoedken, EKotecki, BMartinez, GMerta, PMorytko, MShekhar, SSkinner, BStewart, KVoss, JWallace, GWang, LWang, LWishart, N Design and synthesis of tricyclic cores for kinase inhibition. Bioorg Med Chem Lett 23:693-8 (2013)  
Target
Name:
Tyrosine-protein kinase JAK2
Synonyms:
JAK-2 JAK2_HUMAN Janus kinase 2 (JAK2) | Janus kinase 2 (a protein tyrosine kinase)
Type:
Protein
Mol. Mass.:
130684.68
Organism:
Homo sapiens (Human)
Description:
O60674
Residue:
1132
  
Inhibitor
Name:
BDBM50393756
Synonyms:
CHEMBL2159198
Type:
Small organic molecule
Emp. Form.:
C15H18N4
Mol. Mass.:
254.3302
SMILES:
Cc1nc2cnc3[nH]ccc3c2n1C1CCCCC1
: