Target
Tyrosine-protein kinase JAK1
Ligand
BDBM50393756
Substrate
Meas. Tech.
ChEMBL_940566 (CHEMBL2327340)
EC50
180±n/a nM
Citation
 Van Epps, SFiamengo, BEdmunds, JEricsson, AFrank, KFriedman, MGeorge, DGeorge, JGoedken, EKotecki, BMartinez, GMerta, PMorytko, MShekhar, SSkinner, BStewart, KVoss, JWallace, GWang, LWang, LWishart, N Design and synthesis of tricyclic cores for kinase inhibition. Bioorg Med Chem Lett 23:693-8 (2013)  
Target
Name:
Tyrosine-protein kinase JAK1
Synonyms:
JAK-1 JAK1A JAK1_HUMAN Janus kinase 1 (JAK1) | Janus kinase 1 JAK1
Type:
Protein
Mol. Mass.:
133293.73
Organism:
Homo sapiens (Human)
Description:
P23458
Residue:
1154
  
Inhibitor
Name:
BDBM50393756
Synonyms:
CHEMBL2159198
Type:
Small organic molecule
Emp. Form.:
C15H18N4
Mol. Mass.:
254.3302
SMILES:
Cc1nc2cnc3[nH]ccc3c2n1C1CCCCC1
: