Target
Vascular endothelial growth factor receptor 2
Ligand
BDBM50393756
Substrate
Meas. Tech.
ChEMBL_940570 (CHEMBL2327344)
IC50
2600±n/a nM
Citation
 Van Epps, SFiamengo, BEdmunds, JEricsson, AFrank, KFriedman, MGeorge, DGeorge, JGoedken, EKotecki, BMartinez, GMerta, PMorytko, MShekhar, SSkinner, BStewart, KVoss, JWallace, GWang, LWang, LWishart, N Design and synthesis of tricyclic cores for kinase inhibition. Bioorg Med Chem Lett 23:693-8 (2013)  
Target
Name:
Vascular endothelial growth factor receptor 2
Synonyms:
CD_antigen=CD309 Fetal liver kinase 1 (FLK-1) KDR Protein-tyrosine kinase receptor Flk-1 VEGFR-2 VEGFR2 Vascular Endothelial Growth Factor Receptor Kinase 2 Vascular endothelial growth factor receptor 2 (KDR) Vascular endothelial growth factor receptor 2 (VEGFR2) Vascular endothelial growth factor receptor-2 (VEGFR-2)
Type:
Receptor Tyrosine Kinase
Mol. Mass.:
151510.97
Organism:
Homo sapiens (Human)
Description:
P35968
Residue:
1356
  
Inhibitor
Name:
BDBM50393756
Synonyms:
CHEMBL2159198
Type:
Small organic molecule
Emp. Form.:
C15H18N4
Mol. Mass.:
254.3302
SMILES:
Cc1nc2cnc3[nH]ccc3c2n1C1CCCCC1
: