Target
Membrane primary amine oxidase
Ligand
BDBM50427025
Substrate
Meas. Tech.
ChEMBL_939406 (CHEMBL2327672)
IC50
>10000±n/a nM
Citation
 Inoue, TMorita, MTojo, TYoshihara, KNagashima, AMoritomo, AOhkubo, MMiyake, H Synthesis and SAR study of new thiazole derivatives as vascular adhesion protein-1 (VAP-1) inhibitors for the treatment of diabetic macular edema. Bioorg Med Chem 21:1219-33 (2013)  
Target
Name:
Membrane primary amine oxidase
Synonyms:
AOC3 Amine oxidase, copper containing Semicarbazide-sensitive amine oxidase/ Vascular adhesion protein 1 (SSAO/VAP-1) Vascular adhesion protein 1 (VAP-1)
Type:
Protein
Mol. Mass.:
84620.86
Organism:
Homo sapiens (Human)
Description:
Q16853
Residue:
763
  
Inhibitor
Name:
BDBM50427025
Synonyms:
CHEMBL2326858
Type:
Small organic molecule
Emp. Form.:
C14H16N4OS2
Mol. Mass.:
320.433
SMILES:
CC(=O)Nc1nc(CCc2ccc(NC(N)=S)cc2)cs1
: