Target
Beta-secretase 2
Ligand
BDBM50427058
Substrate
Meas. Tech.
ChEMBL_940076 (CHEMBL2328010)
IC50
21000±n/a nM
Citation
 Mok, NYChadwick, JKellett, KACasas-Arce, EHooper, NMJohnson, APFishwick, CW Discovery of biphenylacetamide-derived inhibitors of BACE1 using de novo structure-based molecular design. J Med Chem 56:1843-52 (2013)  
Target
Name:
Beta-secretase 2
Synonyms:
AEPLC ASP1 Asp 1 Aspartyl protease 1 BACE2_HUMAN Beta-secretase (BACE) Beta-secretase 2 (BACE-2) Beta-site APP-cleaving enzyme 2 Memapsin-1 beta-Secretase (BACE-2)
Type:
Protein
Mol. Mass.:
56171.20
Organism:
Homo sapiens (Human)
Description:
Q9Y5Z0
Residue:
518
  
Inhibitor
Name:
BDBM50427058
Synonyms:
CHEMBL2322538
Type:
Small organic molecule
Emp. Form.:
C29H28N2O
Mol. Mass.:
420.5454
SMILES:
NCc1ccc(CNC(=O)C(Cc2ccccc2)c2ccc(cc2)-c2ccccc2)cc1
: