Target
RAC-gamma serine/threonine-protein kinase
Ligand
BDBM50427332
Substrate
Meas. Tech.
ChEMBL_941087 (CHEMBL2330884)
IC50
10.0±n/a nM
Citation
 Addie, MBallard, PButtar, DCrafter, CCurrie, GDavies, BRDebreczeni, JDry, HDudley, PGreenwood, RJohnson, PDKettle, JGLane, CLamont, GLeach, ALuke, RWMorris, JOgilvie, DPage, KPass, MPearson, SRuston, L Discovery of 4-amino-N-[(1S)-1-(4-chlorophenyl)-3-hydroxypropyl]-1-(7H-pyrrolo[2,3-d]pyrimidin-4-yl)piperidine-4-carboxamide (AZD5363), an orally bioavailable, potent inhibitor of Akt kinases. J Med Chem 56:2059-73 (2013)  
Target
Name:
RAC-gamma serine/threonine-protein kinase
Synonyms:
AKT3 PKB gamma Protein kinase Akt-3 Protein kinase B, gamma RAC-gamma serine/threonine-protein kinase Serine/threonine-protein kinase AKT | Serine/threonine-protein kinase AKT3
Type:
Enzyme
Mol. Mass.:
55769.36
Organism:
Homo sapiens (Human)
Description:
Residue:
479
  
Inhibitor
Name:
BDBM50427332
Synonyms:
CHEMBL2325996 US11236095, Example 49 | US9492453, 49
Type:
Small organic molecule
Emp. Form.:
C27H36ClN7O
Mol. Mass.:
510.074
SMILES:
NC1(CCN(CC1)c1ncnc2[nH]ccc12)C(=O)NC(CCCN1CCCCC1)c1ccc(Cl)cc1
: