Target
Cannabinoid receptor 2
Ligand
BDBM50427434
Substrate
Meas. Tech.
ChEMBL_941210 (CHEMBL2329721)
Ki
1101±n/a nM
Citation
 Yang, PWang, LFeng, RAlmehizia, AATong, QMyint, KZOuyang, QAlqarni, MHWang, LXie, XQ Novel triaryl sulfonamide derivatives as selective cannabinoid receptor 2 inverse agonists and osteoclast inhibitors: discovery, optimization, and biological evaluation. J Med Chem 56:2045-58 (2013)  
Target
Name:
Cannabinoid receptor 2
Synonyms:
CANNABINOID CB2 CB2 CB2B CNR2_HUMAN Cannabinoid CB2 receptor Cannabinoid receptor 2 (CB2R) | hCB2
Type:
G Protein-Coupled Receptor (GPCR)
Mol. Mass.:
39690.94
Organism:
Homo sapiens (Human)
Description:
P34972
Residue:
360
  
Inhibitor
Name:
BDBM50427434
Synonyms:
CHEMBL2326275
Type:
Small organic molecule
Emp. Form.:
C24H35FN2O2S
Mol. Mass.:
434.61
SMILES:
CCCCCCCN(Cc1ccc(cc1)N(CC)CC)S(=O)(=O)c1ccc(F)cc1
: