Target
Cannabinoid receptor 2
Ligand
BDBM50427442
Substrate
Meas. Tech.
ChEMBL_941210 (CHEMBL2329721)
Ki
192±n/a nM
Citation
 Yang, PWang, LFeng, RAlmehizia, AATong, QMyint, KZOuyang, QAlqarni, MHWang, LXie, XQ Novel triaryl sulfonamide derivatives as selective cannabinoid receptor 2 inverse agonists and osteoclast inhibitors: discovery, optimization, and biological evaluation. J Med Chem 56:2045-58 (2013)  
Target
Name:
Cannabinoid receptor 2
Synonyms:
CANNABINOID CB2 CB2 CB2B CNR2_HUMAN Cannabinoid CB2 receptor Cannabinoid receptor 2 (CB2R) | hCB2
Type:
G Protein-Coupled Receptor (GPCR)
Mol. Mass.:
39690.94
Organism:
Homo sapiens (Human)
Description:
P34972
Residue:
360
  
Inhibitor
Name:
BDBM50427442
Synonyms:
CHEMBL2326304
Type:
Small organic molecule
Emp. Form.:
C22H22ClNO4S2
Mol. Mass.:
463.997
SMILES:
Cc1ccc(cc1)S(=O)(=O)N(CCc1ccc(Cl)cc1)S(=O)(=O)c1ccc(C)cc1
: