Target
Cannabinoid receptor 1
Ligand
BDBM50427413
Substrate
Meas. Tech.
ChEMBL_941211 (CHEMBL2329722)
Ki
1297±n/a nM
Citation
 Yang, PWang, LFeng, RAlmehizia, AATong, QMyint, KZOuyang, QAlqarni, MHWang, LXie, XQ Novel triaryl sulfonamide derivatives as selective cannabinoid receptor 2 inverse agonists and osteoclast inhibitors: discovery, optimization, and biological evaluation. J Med Chem 56:2045-58 (2013)  
Target
Name:
Cannabinoid receptor 1
Synonyms:
CANN6 CB-R CNR CNR1_HUMAN Cannabinoid receptor Cannabinoid receptor 1 (brain)
Type:
G Protein-Coupled Receptor (GPCR)
Mol. Mass.:
52868.96
Organism:
Homo sapiens (Human)
Description:
P21554
Residue:
472
  
Inhibitor
Name:
BDBM50427413
Synonyms:
CHEMBL2326297
Type:
Small organic molecule
Emp. Form.:
C25H30N2O3S
Mol. Mass.:
438.582
SMILES:
CCN(CC)c1ccc(CN(c2ccc(C)cc2)S(=O)(=O)c2ccc(OC)cc2)cc1
: