Target
Androgen receptor
Ligand
BDBM50427620
Substrate
Meas. Tech.
ChEMBL_941808 (CHEMBL2329799)
EC50
0.150000±n/a nM
Citation
 Liedtke, AJAdeniji, AOChen, MByrns, MCJin, YChristianson, DWMarnett, LJPenning, TM Development of potent and selective indomethacin analogues for the inhibition of AKR1C3 (Type 5 17ß-hydroxysteroid dehydrogenase/prostaglandin F synthase) in castrate-resistant prostate cancer. J Med Chem 56:2429-46 (2013)  
Target
Name:
Androgen receptor
Synonyms:
ANDR_HUMAN Androgen Receptor Androgen receptor/Baculoviral IAP repeat-containing protein 2 Dihydrotestosterone receptor Nuclear receptor subfamily 3 group C member 4
Type:
Receptor
Mol. Mass.:
99185.27
Organism:
Homo sapiens (Human)
Description:
CHO cells were stably transfected with human AR gene.
Residue:
920
  
Inhibitor
Name:
BDBM50427620
Synonyms:
CHEMBL2323507 | US9346803, 2
Type:
Small organic molecule
Emp. Form.:
C20H18ClNO4
Mol. Mass.:
371.814
SMILES:
COc1ccc2n(C(=O)c3ccc(Cl)cc3)c(CCC(O)=O)c(C)c2c1
: