Target
Aldo-keto reductase family 1 member C3
Ligand
BDBM50427622
Substrate
Meas. Tech.
ChEMBL_941824 (CHEMBL2329815)
IC50
90±n/a nM
Citation
 Liedtke, AJAdeniji, AOChen, MByrns, MCJin, YChristianson, DWMarnett, LJPenning, TM Development of potent and selective indomethacin analogues for the inhibition of AKR1C3 (Type 5 17ß-hydroxysteroid dehydrogenase/prostaglandin F synthase) in castrate-resistant prostate cancer. J Med Chem 56:2429-46 (2013)  
Target
Name:
Aldo-keto reductase family 1 member C3
Synonyms:
17-beta-Hydroxysteroid Dehydrogenase 5 (17-beta-HSD5, AKR1C3) AK1C3_HUMAN Aldo-keto reductase family 1 member C3 Aldo-keto reductase family 1 member C3 (AK1C3a) Aldo-keto-reductase family 1 member C3 Dihydrodiol dehydrogenase 3 Estradiol 17-beta-dehydrogenase KIAA0119 Prostaglandin F synthase Trans-1,2-dihydrobenzene-1,2-diol dehydrogenase
Type:
Enzyme
Mol. Mass.:
36859.86
Organism:
Homo sapiens (Human)
Description:
P42330
Residue:
323
  
Inhibitor
Name:
BDBM50427622
Synonyms:
CHEMBL2323508 | US9346803, Table 2, Compound 10: 3-[1-(4-chlorobenzoyl)-3-ethyl-5-methoxy-1H-indol-2-yl]propanoic acid
Type:
Small organic molecule
Emp. Form.:
C21H20ClNO4
Mol. Mass.:
385.841
SMILES:
CCc1c(CCC(O)=O)n(C(=O)c2ccc(Cl)cc2)c2ccc(OC)cc12
: