Target
Glutamate receptor 2
Ligand
BDBM50427677
Substrate
Meas. Tech.
ChEMBL_941836 (CHEMBL2329827)
Ki
560000±n/a nM
Citation
 Juknaite, LSugamata, YTokiwa, KIshikawa, YTakamizawa, SEng, ASakai, RPickering, DSFrydenvang, KSwanson, GTKastrup, JSOikawa, M Studies on an (S)-2-amino-3-(3-hydroxy-5-methyl-4-isoxazolyl)propionic acid (AMPA) receptor antagonist IKM-159: asymmetric synthesis, neuroactivity, and structural characterization. J Med Chem 56:2283-93 (2013)  
Target
Name:
Glutamate receptor 2
Synonyms:
AMPA-selective glutamate receptor 2 GRIA2 GluR-2 GluR-K2 Glutamate receptor 2 Glutamate receptor AMPA 2/3 Glutamate receptor ionotropic, AMPA 2
Type:
Enzyme Catalytic Domain
Mol. Mass.:
98825.96
Organism:
Homo sapiens (Human)
Description:
Glutamate AMPA 2 GRIA2 HUMAN::P42262
Residue:
883
  
Inhibitor
Name:
BDBM50427677
Synonyms:
CHEMBL2323527
Type:
Small organic molecule
Emp. Form.:
C12H14N2O6
Mol. Mass.:
282.2494
SMILES:
OC(=O)C[C@@]12O[C@H]3C=CCN[C@H]3[C@@H]1C(=O)NC2C(O)=O
: