Target
Histone-lysine N-methyltransferase EHMT1
Ligand
BDBM50427772
Substrate
Meas. Tech.
ChEMBL_941986 (CHEMBL2330206)
IC50
25000±n/a nM
Citation
 Liu, FLi, FMa, ADobrovetsky, EDong, AGao, CKorboukh, ILiu, JSmil, DBrown, PJFrye, SVArrowsmith, CHSchapira, MVedadi, MJin, J Exploiting an allosteric binding site of PRMT3 yields potent and selective inhibitors. J Med Chem 56:2110-24 (2013)  
Target
Name:
Histone-lysine N-methyltransferase EHMT1
Synonyms:
EHMT1 EUHMTASE1 Euchromatic histone-lysine N-methyltransferase 1 GLP H3-K9-HMTase 5 Histone-lysine N-methyltransferase EHMT1/EHMT2 KMT1D | Lysine N-methyltransferase 1D
Type:
PROTEIN
Mol. Mass.:
141443.67
Organism:
Homo sapiens (Human)
Description:
ChEMBL_1450367
Residue:
1298
  
Inhibitor
Name:
BDBM50427772
Synonyms:
CHEMBL2325183
Type:
Small organic molecule
Emp. Form.:
C15H12N4O2S
Mol. Mass.:
312.346
SMILES:
O=C(NCC(=O)c1ccccc1)Nc1ccc2nnsc2c1
: