Target
Poly [ADP-ribose] polymerase 1
Ligand
BDBM50427929
Substrate
Meas. Tech.
ChEMBL_941003 (CHEMBL2330729)
IC50
1.9±n/a nM
Citation
 Ye, NChen, CHChen, TSong, ZHe, JXHuan, XJSong, SSLiu, QChen, YDing, JXu, YMiao, ZHZhang, A Design, synthesis, and biological evaluation of a series of benzo[de][1,7]naphthyridin-7(8H)-ones bearing a functionalized longer chain appendage as novel PARP1 inhibitors. J Med Chem 56:2885-903 (2013)  
Target
Name:
Poly [ADP-ribose] polymerase 1
Synonyms:
(ARTD1 or PARP1) 2.4.2.30 ADPRT ARTD1 Human diphtheria toxin-like ADP-ribosyltransferase (ARTD1 or PARP1) NT-PARP-1 PARP1 PPOL Poly [ADP-ribose] polymerase 1 (PARP) Poly [ADP-ribose] polymerase 1 (PARP1) Poly [ADP-ribose] polymerase 1, 28-kDa form Poly [ADP-ribose] polymerase 1, processed C-terminus Poly [ADP-ribose] polymerase-1 Poly(ADP-ribose) polymerase-1 (ARTD1/PARP1) Protein poly-ADP-ribosyltransferase PARP1 | Synonyms=ADPRT
Type:
Mol. Mass.:
113114.22
Organism:
Homo sapiens (Human)
Description:
P09874
Residue:
1014
  
Inhibitor
Name:
BDBM50427929
Synonyms:
CHEMBL2323222
Type:
Small organic molecule
Emp. Form.:
C33H30FN5O4
Mol. Mass.:
579.6208
SMILES:
Fc1ccc(Cc2n[nH]c(=O)c3ccccc23)cc1C(=O)N1CCC(CC1)C(=O)N1CCc2cccc3C(=O)NCC1c23
: