Target
C-C chemokine receptor type 2
Ligand
BDBM50428329
Substrate
Meas. Tech.
ChEMBL_947374 (CHEMBL2344607)
Ki
2.0±n/a nM
Citation
 Abdel-Magid, AF Targeting CCR2 Receptor To Treat Inflammation Diseases and Disorders. ACS Med Chem Lett 4:371-2 (2013)  
Target
Name:
C-C chemokine receptor type 2
Synonyms:
C-C chemokine receptor type 2 (CCR2) CCR2_HUMAN Chemoattractant Cytokine Receptor 2 (CCR2) Monocyte chemotactic protein-1 (MCP-1)
Type:
Enzyme
Mol. Mass.:
41932.32
Organism:
Homo sapiens (Human)
Description:
P41597
Residue:
374
  
Inhibitor
Name:
BDBM50428329
Synonyms:
CHEMBL2338390
Type:
Small organic molecule
Emp. Form.:
C28H33F6N5O3
Mol. Mass.:
601.5837
SMILES:
CO[C@@H]1COCC[C@@H]1NC1CCN(CC1)C(=O)c1nc(nc(N2CCc3cc(ccc3C2)C(F)(F)F)c1C)C(F)(F)F
: