Target
Carbonic anhydrase 9
Ligand
BDBM50428380
Substrate
Meas. Tech.
ChEMBL_942103 (CHEMBL2340801)
Ki
8200±n/a nM
Citation
 Carta, FVullo, DMaresca, AScozzafava, ASupuran, CT Mono-/dihydroxybenzoic acid esters and phenol pyridinium derivatives as inhibitors of the mammalian carbonic anhydrase isoforms I, II, VII, IX, XII and XIV. Bioorg Med Chem 21:1564-9 (2013)  
Target
Name:
Carbonic anhydrase 9
Synonyms:
CA-IX CAH9_HUMAN Carbonic anhydrase 9 (CA IX) Carbonic anhydrase 9 precursor Carbonic anhydrase IX (CAIX) Carbonic anhydrases; II & IX MN RCC-associated antigen G250
Type:
Enzyme
Mol. Mass.:
49669.03
Organism:
Homo sapiens (Human)
Description:
Catalytic domain of human cloned isozyme was used in the assay
Residue:
459
  
Inhibitor
Name:
BDBM50428380
Synonyms:
E214 Ethyl Parahydroxybenzoate
Type:
Small organic molecule
Emp. Form.:
C9H10O3
Mol. Mass.:
166.1739
SMILES:
CCOC(=O)c1ccc(O)cc1
: