Target
Carbonic anhydrase 7
Ligand
BDBM50428380
Substrate
Meas. Tech.
ChEMBL_942104 (CHEMBL2340802)
Ki
8700±n/a nM
Citation
 Carta, FVullo, DMaresca, AScozzafava, ASupuran, CT Mono-/dihydroxybenzoic acid esters and phenol pyridinium derivatives as inhibitors of the mammalian carbonic anhydrase isoforms I, II, VII, IX, XII and XIV. Bioorg Med Chem 21:1564-9 (2013)  
Target
Name:
Carbonic anhydrase 7
Synonyms:
CA-VII CAH7_HUMAN Carbonic anhydrase Carbonic anhydrase VII (CA VII)
Type:
Enzyme
Mol. Mass.:
29664.11
Organism:
Homo sapiens (Human)
Description:
Human cloned isozyme.
Residue:
264
  
Inhibitor
Name:
BDBM50428380
Synonyms:
E214 Ethyl Parahydroxybenzoate
Type:
Small organic molecule
Emp. Form.:
C9H10O3
Mol. Mass.:
166.1739
SMILES:
CCOC(=O)c1ccc(O)cc1
: