Target
Carbonic anhydrase 2
Ligand
BDBM10859
Substrate
Meas. Tech.
ChEMBL_942133 (CHEMBL2341289)
Ki
320±n/a nM
Citation
 Demirdag, RÇomakli, VSentürk, MEkinci, DIrfan Küfrevioglu, ÖSupuran, CT Purification and characterization of carbonic anhydrase from sheep kidney and effects of sulfonamides on enzyme activity. Bioorg Med Chem 21:1522-5 (2013)  
Target
Name:
Carbonic anhydrase 2
Synonyms:
CA-II CAC Carbonate dehydratase II Carbonic anhydrase 2 (CA-II) Carbonic anhydrase C Carbonic anhydrase II (CA-II) Carbonic anhydrase II (hCA II) | Carbonic anhydrase isoenzyme II (hCA II)
Type:
Enzyme
Mol. Mass.:
29250.71
Organism:
Homo sapiens (Human)
Description:
P00918
Residue:
260
  
Inhibitor
Name:
BDBM10859
Synonyms:
4-methylbenzene-1-sulfonamide aromatic/heteroaromatic sulfonamide 4 | hCA inhibitor, 7
Type:
Small organic molecule
Emp. Form.:
C7H9NO2S
Mol. Mass.:
171.217
SMILES:
Cc1ccc(cc1)S(N)(=O)=O
: