Target
Botulinum neurotoxin type A
Ligand
BDBM50429184
Substrate
Meas. Tech.
ChEMBL_943588 (CHEMBL2343855)
IC50
1400±n/a nM
Citation
 Šilhár, PSilvaggi, NRPellett, SCapková, KJohnson, EAAllen, KNJanda, KD Evaluation of adamantane hydroxamates as botulinum neurotoxin inhibitors: synthesis, crystallography, modeling, kinetic and cellular based studies. Bioorg Med Chem 21:1344-8 (2013)  
Target
Name:
Botulinum neurotoxin type A
Synonyms:
BXA1_CLOBO bonT | botA
Type:
PROTEIN
Mol. Mass.:
149450.01
Organism:
Clostridium botulinum
Description:
ChEMBL_1510137
Residue:
1296
  
Inhibitor
Name:
BDBM50429184
Synonyms:
CHEMBL2336726
Type:
Small organic molecule
Emp. Form.:
C12H18ClNO2
Mol. Mass.:
243.73
SMILES:
ONC(=O)CC12CC3CC(CC(Cl)(C3)C1)C2
: