Target
P2Y purinoceptor 11
Ligand
BDBM50429536
Substrate
Meas. Tech.
ChEMBL_945219 (CHEMBL2339545)
Ki
>15000±n/a nM
Citation
 Chao, HTurdi, HHerpin, TFRoberge, JYLiu, YSchnur, DMPoss, MARehfuss, RHua, JWu, QPrice, LAAbell, LMSchumacher, WABostwick, JSSteinbacher, TEStewart, ABOgletree, MLHuang, CSChang, MCacace, AMArcuri, MJCelani, DWexler, RRLawrence, RM Discovery of 2-(phenoxypyridine)-3-phenylureas as small molecule P2Y1 antagonists. J Med Chem 56:1704-14 (2013)  
Target
Name:
P2Y purinoceptor 11
Synonyms:
P2RY11 P2Y11 Purinergic receptor P2Y11
Type:
PROTEIN
Mol. Mass.:
40366.02
Organism:
Homo sapiens (Human)
Description:
ChEMBL_1362532
Residue:
374
  
Inhibitor
Name:
BDBM50429536
Synonyms:
CHEMBL2333771
Type:
Small organic molecule
Emp. Form.:
C26H31N3O2
Mol. Mass.:
417.5432
SMILES:
CC(C)(C)c1ccc(NC(=O)Nc2cccnc2Oc2ccccc2C(C)(C)C)cc1
: