Target
P2Y purinoceptor 1
Ligand
BDBM50429564
Substrate
Meas. Tech.
ChEMBL_945224 (CHEMBL2339550)
Ki
128±n/a nM
Citation
 Chao, HTurdi, HHerpin, TFRoberge, JYLiu, YSchnur, DMPoss, MARehfuss, RHua, JWu, QPrice, LAAbell, LMSchumacher, WABostwick, JSSteinbacher, TEStewart, ABOgletree, MLHuang, CSChang, MCacace, AMArcuri, MJCelani, DWexler, RRLawrence, RM Discovery of 2-(phenoxypyridine)-3-phenylureas as small molecule P2Y1 antagonists. J Med Chem 56:1704-14 (2013)  
Target
Name:
P2Y purinoceptor 1
Synonyms:
ATP receptor P2RY1_HUMAN P2Y1 Purinergic receptor P2Y1
Type:
Enzyme
Mol. Mass.:
42090.25
Organism:
Homo sapiens (Human)
Description:
P47900
Residue:
373
  
Inhibitor
Name:
BDBM50429564
Synonyms:
CHEMBL2333350
Type:
Small organic molecule
Emp. Form.:
C19H13ClF3N3O2
Mol. Mass.:
407.774
SMILES:
FC(F)(F)c1cccc(Oc2ncccc2NC(=O)Nc2cccc(Cl)c2)c1
: