Target
cAMP-specific 3',5'-cyclic phosphodiesterase 4B
Ligand
BDBM50042058
Substrate
Meas. Tech.
ChEMBL_947624 (CHEMBL2340160)
IC50
500±n/a nM
Citation
 Liu, AHuang, LWang, ZLuo, ZMao, FShan, WXie, JLai, KLi, X Hybrids consisting of the pharmacophores of salmeterol and roflumilast or phthalazinone: dualß2-adrenoceptor agonists-PDE4 inhibitors for the treatment of COPD. Bioorg Med Chem Lett 23:1548-52 (2013)  
Target
Name:
cAMP-specific 3',5'-cyclic phosphodiesterase 4B
Synonyms:
3',5'-cyclic phosphodiesterase Isoform PDE4B1 PDE4B PDE4B_HUMAN Phosphodiesterase 4B (PDE4B) Phosphodiesterase Type 4 (PDE4B)
Type:
Protein
Mol. Mass.:
83318.87
Organism:
Homo sapiens (Human)
Description:
Q07343
Residue:
736
  
Inhibitor
Name:
BDBM50042058
Synonyms:
(-)-rolipram (R)-(-)-rolipram CHEMBL430893
Type:
Small organic molecule
Emp. Form.:
C16H21NO3
Mol. Mass.:
275.3428
SMILES:
COc1ccc(cc1OC1CCCC1)[C@@H]1CNC(=O)C1
: