Target
72 kDa type IV collagenase
Ligand
BDBM50429775
Substrate
Meas. Tech.
ChEMBL_948151 (CHEMBL2338837)
IC50
6.2±n/a nM
Citation
 Shi, ZHLi, NGShi, QPTang, HTang, YPLi, WYin, LYang, JPDuan, JA Synthesis and structure-activity relationship analysis of caffeic acid amides as selective matrix metalloproteinase inhibitors. Bioorg Med Chem Lett 23:1206-11 (2013)  
Target
Name:
72 kDa type IV collagenase
Synonyms:
72 kDa gelatinase CLG4A Gelatinase A (MMP-2) MMP2_HUMAN Matrix metalloproteinase-2 (MMP 2) Matrix metalloproteinases 2 (MMP-2) | TBE-1
Type:
Enzyme
Mol. Mass.:
73870.36
Organism:
Homo sapiens (Human)
Description:
P08253
Residue:
660
  
Inhibitor
Name:
BDBM50429775
Synonyms:
CHEMBL2336353 | N-(2-Hydroxyphenyl)Cinnamamide
Type:
Small organic molecule
Emp. Form.:
C15H13NO2
Mol. Mass.:
239.2692
SMILES:
Oc1ccccc1NC(=O)\C=C\c1ccccc1
: