Target
Matrix metalloproteinase-9
Ligand
BDBM50429766
Substrate
Meas. Tech.
ChEMBL_948150 (CHEMBL2338836)
IC50
4.3±n/a nM
Citation
 Shi, ZHLi, NGShi, QPTang, HTang, YPLi, WYin, LYang, JPDuan, JA Synthesis and structure-activity relationship analysis of caffeic acid amides as selective matrix metalloproteinase inhibitors. Bioorg Med Chem Lett 23:1206-11 (2013)  
Target
Name:
Matrix metalloproteinase-9
Synonyms:
67 kDa matrix metalloproteinase-9 92 kDa gelatinase CLG4B Gelatinase B MMP9 Matrix metalloproteinase 9 (MMP-9) Matrix metalloproteinase-9 (MMP9)
Type:
Enzyme
Mol. Mass.:
78452.28
Organism:
Homo sapiens (Human)
Description:
P14780
Residue:
707
  
Inhibitor
Name:
BDBM50429766
Synonyms:
CHEMBL2336343
Type:
Small organic molecule
Emp. Form.:
C16H15NO3
Mol. Mass.:
269.2952
SMILES:
COc1ccc(NC(=O)\C=C\c2ccc(O)cc2)cc1
: