Target
72 kDa type IV collagenase
Ligand
BDBM50429749
Substrate
Meas. Tech.
ChEMBL_948151 (CHEMBL2338837)
IC50
5.1±n/a nM
Citation
 Shi, ZHLi, NGShi, QPTang, HTang, YPLi, WYin, LYang, JPDuan, JA Synthesis and structure-activity relationship analysis of caffeic acid amides as selective matrix metalloproteinase inhibitors. Bioorg Med Chem Lett 23:1206-11 (2013)  
Target
Name:
72 kDa type IV collagenase
Synonyms:
72 kDa gelatinase CLG4A Gelatinase A (MMP-2) MMP2_HUMAN Matrix metalloproteinase-2 (MMP 2) Matrix metalloproteinases 2 (MMP-2) | TBE-1
Type:
Enzyme
Mol. Mass.:
73870.36
Organism:
Homo sapiens (Human)
Description:
P08253
Residue:
660
  
Inhibitor
Name:
BDBM50429749
Synonyms:
CHEMBL421295
Type:
Small organic molecule
Emp. Form.:
C15H13NO4
Mol. Mass.:
271.268
SMILES:
Oc1ccc(\C=C\C(=O)Nc2ccccc2O)cc1O
: