Target
Melanin-concentrating hormone receptor 1
Ligand
BDBM50430122
Substrate
Meas. Tech.
ChEMBL_942921 (CHEMBL2342870)
IC50
30±n/a nM
Citation
 Lim, CJKim, JYLee, BHOh, KSYi, KY Synthesis and SAR study of pyrrolo[3,4-b]pyridin-7(6H)-one derivatives as melanin concentrating hormone receptor 1 (MCH-R1) antagonists. Bioorg Med Chem Lett 23:1736-9 (2013)  
Target
Name:
Melanin-concentrating hormone receptor 1
Synonyms:
G-protein coupled receptor 24 MCH receptor 1 MCH-R1 MCHR-1 MCHR1_HUMAN Melanin-Concentrating Hormone Receptor 1 (MCH1R) Melanin-concentrating hormone receptor 1 (MCH-1) Melanin-concentrating hormone receptor 1 (MCHR-1) SLC-1 Somatostatin receptor-like protein
Type:
G Protein-Coupled Receptor (GPCR)
Mol. Mass.:
45976.27
Organism:
Homo sapiens (Human)
Description:
Membranes from CHO-K1 cells stably expressing human MCH1R were used in assays.
Residue:
422
  
Inhibitor
Name:
BDBM50430122
Synonyms:
CHEMBL2337725
Type:
Small organic molecule
Emp. Form.:
C26H26FN3O3S
Mol. Mass.:
479.566
SMILES:
COc1cc(ccc1OCCN1CCCC1)N1Cc2ccc(Sc3ccc(F)cc3)nc2C1=O
: