Target
Mitogen-activated protein kinase 10
Ligand
BDBM50430445
Substrate
Meas. Tech.
ChEMBL_944323 (CHEMBL2344423)
Kd
743±n/a nM
Citation
 Kim, MHRyu, JSHah, JM 3D-QSAR studies of 1,2-diaryl-1H-benzimidazole derivatives as JNK3 inhibitors with protective effects in neuronal cells. Bioorg Med Chem Lett 23:1639-42 (2013)  
Target
Name:
Mitogen-activated protein kinase 10
Synonyms:
JNK3 MAP kinase p49 3F12 MK10_HUMAN Mitogen-activated protein kinase 10 (Stress-activated protein kinase JNK3) (c-Jun N-terminal kinase 3) (MAP kinase p49 3F12) PRKM10 Stress-activated protein kinase JNK3 | c-Jun N-terminal kinase 3 (JNK3)
Type:
Enzyme
Mol. Mass.:
52586.89
Organism:
Homo sapiens (Human)
Description:
Residue:
464
  
Inhibitor
Name:
BDBM50430445
Synonyms:
CHEMBL2334721
Type:
Small organic molecule
Emp. Form.:
C28H27N5O
Mol. Mass.:
449.5469
SMILES:
COc1ccc2n(c(nc2c1)-c1ccc2ccccc2c1)-c1ccnc(NC2CCCCC2)n1
: