Target
Mu-type opioid receptor
Ligand
BDBM50430611
Substrate
Meas. Tech.
ChEMBL_947792 (CHEMBL2342211)
EC50
0.120000±n/a nM
Citation
 Greedy, BMBradbury, FThomas, MPGrivas, KCami-Kobeci, GArchambeau, ABosse, KClark, MJAceto, MLewis, JWTraynor, JRHusbands, SM Orvinols with mixed kappa/mu opioid receptor agonist activity. J Med Chem 56:3207-16 (2013)  
Target
Name:
Mu-type opioid receptor
Synonyms:
MOR-1 Mu-type opioid receptor (MOR) OPRM_RAT Opioid receptor B Ror-b
Type:
G Protein-Coupled Receptor (GPCR)
Mol. Mass.:
44503.11
Organism:
Rattus norvegicus (rat)
Description:
Competition binding assays were carried out using membrane preparations from transfected HN9.10 cells that constitutively expressed the mu opioid receptor.
Residue:
398
  
Inhibitor
Name:
BDBM50430611
Synonyms:
CHEMBL2338725
Type:
Small organic molecule
Emp. Form.:
C30H41NO4
Mol. Mass.:
479.6508
SMILES:
CO[C@]12CC[C@@]3(C[C@@H]1[C@@H](O)C1CCCCC1)[C@H]1Cc4ccc(O)c5O[C@@H]2[C@]3(CCN1CC1CC1)c45
: